{"text_format":"1","workbook":"xlsx","n_sheets":5,"sheets":["Data","Sheet4","RiskSerializationData","Simulations","Nonlinear_1 (2)"],"not_rendered":{"charts":2,"images":1,"macros":1,"external_links":2,"defined_names":115,"comments":2,"pivot_tables":0},"unopened":[],"bounds":{"document_bytes":16777216,"sheet_cells":100000,"rows_first":2000,"rows_last":500,"rows_between":2000,"halvings":0,"cell_chars":16384,"cell_head_chars":4096},"cells_cut":0,"cells_raw":0,"read":"row_number_cap","date_system":"1900"}

{"sheet":"Data","index":0,"n_rows":58,"n_cols":82,"rows_kept":58,"cut":false,"hidden":false,"merged":[[8,54,9,54],[8,48,9,48],[8,49,9,49],[8,50,9,50],[8,51,9,51],[8,52,9,52]]}
[]
[null,null,"country=","Chile"]
[null,null,"ifs_code=",228]
[null,null,"Year=",2013]
[]
[]
[]
[]
[]
[null,"t","ifs_code","Country","Year","Y (Nominal Billions USD) ","X (Nominal Billions USD)","Q (Nominal Billions USD)","NFA (Nominal MM USD)","A (Nominal MM USD)","L (Nominal MM USD)","Exchange Rate (End of Period) [LCU/USD]",null,null,null,null,null,null,null,null,null,null,null,null,null,null,null,null,null,null,null,null,null,null,null,null,null,null,null,null,null,null,null,null,null,null,null,null,null,null,null,null,null,null,null,null,null,null,null,null,null,null,null,null,null,"trade balance + sib","trade balance","sib","sib/gdp","pib","pib/gdp","assets",null,"liabilities","liabilities/gdp","yield on assets","yield on liabilities","yield on assets in $","yield on liabilities in $","pcpi","inflation","Real GDP"]
[]
[null,{"$f":"B13-1","v":-31},{"$f":"$D$3","v":228},{"$f":"$D$2","v":"Chile"},{"$f":"+E13-1","v":1982},{"$f":"IF(ISNUMBER(VLOOKUP($C12,[1]NGDPD!$E$2:$CE$305,MATCH($E12,[1]NGDPD!$K$1:$CE$1,0)+6,0)),VLOOKUP($C12,[1]NGDPD!$E$2:$CE$305,MATCH($E12,[1]NGDPD!$K$1:$CE$1,0)+6,0),\"\")","v":25.450818576380268},{"$f":"IF(ISNUMBER(VLOOKUP($C12,[1]BX_WEO!$E$2:$CE$305,MATCH($E12,[1]BX_WEO!$K$1:$CE$1,0)+6,0)),VLOOKUP($C12,[1]BX_WEO!$E$2:$CE$305,MATCH($E12,[1]BX_WEO!$K$1:$CE$1,0)+6,0),\"\")","v":4.6420000000000003},{"$f":"IF(ISNUMBER(VLOOKUP($C12,[1]BM_WEO!$E$2:$CE$304,MATCH($E12,[1]BM_WEO!$K$1:$CE$1,0)+6,0)),VLOOKUP($C12,[1]BM_WEO!$E$2:$CE$304,MATCH($E12,[1]BM_WEO!$K$1:$CE$1,0)+6,0),\"\")","v":5.0529999999999999},{"$f":"IF(AND(ISNUMBER(J12),ISNUMBER(K12)),J12-K12,\"\")","v":238365.66328197892},1030357.3838153799,791991.72053340101,1,null,null,null,null,null,null,null,null,null,null,null,null,null,null,null,null,null,null,null,null,null,null,null,null,null,null,null,null,null,null,null,null,null,null,null,null,null,null,null,null,null,null,null,null,null,null,null,null,null,null,null,null,1982,{"$f":"((G12-H12)/F12) + (BQ12)","v":-1.1866023055159092E-2},{"$f":"((G12-H12)/F12)","v":-1.614879296579599E-2},{"$f":"IF(ISNUMBER(VLOOKUP($C12,[1]BIS_WEO!$E$2:$CE$304,MATCH($E12,[1]BIS_WEO!$K$1:$CE$1,0)+6,0)),VLOOKUP($C12,[1]BIS_WEO!$E$2:$CE$304,MATCH($E12,[1]BIS_WEO!$K$1:$CE$1,0)+6,0),\"\")","v":0.109},{"$f":"BP12/F12","v":4.2827699106368971E-3},35.164000000000001,{"$f":"BR12/(F12)","v":1.3816451480517051},{"$f":"IF(ISNUMBER(VLOOKUP($C12,[1]IA_BP6!$E$2:$CE$304,MATCH($E12,[1]IA_BP6!$K$1:$CE$1,0)+6,0)),VLOOKUP($C12,[1]IA_BP6!$E$2:$CE$304,MATCH($E12,[1]IA_BP6!$K$1:$CE$1,0)+6,0),\"\")","v":""},null,{"$f":"IF(ISNUMBER(VLOOKUP($C12,[1]IL_BP6!$E$2:$CE$304,MATCH($E12,[1]IL_BP6!$K$1:$CE$1,0)+6,0)),VLOOKUP($C12,[1]IL_BP6!$E$2:$CE$304,MATCH($E12,[1]IL_BP6!$K$1:$CE$1,0)+6,0),\"\")","v":""},null,null,null,{"$f":"IF(ISNUMBER(VLOOKUP($C12,[1]BXIP!$E$2:$CD$304,MATCH($E12,[1]BXIP!$K$1:$CD$1,0)+6,0)),VLOOKUP($C12,[1]BXIP!$E$2:$CD$304,MATCH($E12,[1]BXIP!$K$1:$CD$1,0)+6,0),\"\")","v":""},{"$f":"IF(ISNUMBER(VLOOKUP($C12,[1]BMIP!$E$2:$CD$304,MATCH($E12,[1]BXIP!$K$1:$CD$1,0)+6,0)),VLOOKUP($C12,[1]BMIP!$E$2:$CD$304,MATCH($E12,[1]BMIP!$K$1:$CD$1,0)+6,0),\"\")","v":""},{"$f":"IF(ISNUMBER(VLOOKUP($C12,[1]PCPI!$E$2:$CE$304,MATCH($E12,[1]PCPI!$K$1:$CE$1,0)+6,0)),VLOOKUP($C12,[1]PCPI!$E$2:$CE$304,MATCH($E12,[1]PCPI!$K$1:$CE$1,0)+6,0),\"\")","v":5.6556388015873731},null,{"$f":"IF(ISNUMBER(VLOOKUP($C12,[1]NGDP_R!$E$2:$CE$304,MATCH($E12,[1]NGDP_R!$K$1:$CE$1,0)+6,0)),VLOOKUP($C12,[1]NGDP_R!$E$2:$CE$304,MATCH($E12,[1]NGDP_R!$K$1:$CE$1,0)+6,0),\"\")","v":29402.495937809756}]
[null,-30,228,"Chile",1983,{"$f":"IF(ISNUMBER(VLOOKUP($C13,[1]NGDPD!$E$2:$CE$305,MATCH($E13,[1]NGDPD!$K$1:$CE$1,0)+6,0)),VLOOKUP($C13,[1]NGDPD!$E$2:$CE$305,MATCH($E13,[1]NGDPD!$K$1:$CE$1,0)+6,0),\"\")","v":20.672870475156831},{"$f":"IF(ISNUMBER(VLOOKUP($C13,[1]BX_WEO!$E$2:$CE$305,MATCH($E13,[1]BX_WEO!$K$1:$CE$1,0)+6,0)),VLOOKUP($C13,[1]BX_WEO!$E$2:$CE$305,MATCH($E13,[1]BX_WEO!$K$1:$CE$1,0)+6,0),\"\")","v":4.6280000000000001},{"$f":"IF(ISNUMBER(VLOOKUP($C13,[1]BM_WEO!$E$2:$CE$304,MATCH($E13,[1]BM_WEO!$K$1:$CE$1,0)+6,0)),VLOOKUP($C13,[1]BM_WEO!$E$2:$CE$304,MATCH($E13,[1]BM_WEO!$K$1:$CE$1,0)+6,0),\"\")","v":4.0810000000000004},{"$f":"IF(AND(ISNUMBER(J13),ISNUMBER(K13)),J13-K13,\"\")","v":261495.12321429991},1206656.6861428998,945161.56292859989,1,null,null,null,null,null,null,null,null,null,null,null,null,null,null,null,null,null,null,null,null,null,null,null,null,null,null,null,null,null,null,null,null,null,null,null,null,null,null,null,null,null,null,null,null,null,null,null,null,null,null,null,null,1983,3.1151939000145755E-2,{"$f":"((G13-H13)/F13)","v":2.6459799119689015E-2},{"$f":"IF(ISNUMBER(VLOOKUP($C13,[1]BIS_WEO!$E$2:$CE$304,MATCH($E13,[1]BIS_WEO!$K$1:$CE$1,0)+6,0)),VLOOKUP($C13,[1]BIS_WEO!$E$2:$CE$304,MATCH($E13,[1]BIS_WEO!$K$1:$CE$1,0)+6,0),\"\")","v":9.7000000000000003E-2},{"$f":"BP13/F13","v":4.6921398804567385E-3},36.384,1.7599878083560614,{"$f":"IF(ISNUMBER(VLOOKUP($C13,[1]IA_BP6!$E$2:$CE$304,MATCH($E13,[1]IA_BP6!$K$1:$CE$1,0)+6,0)),VLOOKUP($C13,[1]IA_BP6!$E$2:$CE$304,MATCH($E13,[1]IA_BP6!$K$1:$CE$1,0)+6,0),\"\")","v":""},null,{"$f":"IF(ISNUMBER(VLOOKUP($C13,[1]IL_BP6!$E$2:$CE$304,MATCH($E13,[1]IL_BP6!$K$1:$CE$1,0)+6,0)),VLOOKUP($C13,[1]IL_BP6!$E$2:$CE$304,MATCH($E13,[1]IL_BP6!$K$1:$CE$1,0)+6,0),\"\")","v":""},null,null,null,{"$f":"IF(ISNUMBER(VLOOKUP($C13,[1]BXIP!$E$2:$CD$304,MATCH($E13,[1]BXIP!$K$1:$CD$1,0)+6,0)),VLOOKUP($C13,[1]BXIP!$E$2:$CD$304,MATCH($E13,[1]BXIP!$K$1:$CD$1,0)+6,0),\"\")","v":""},{"$f":"IF(ISNUMBER(VLOOKUP($C13,[1]BMIP!$E$2:$CD$304,MATCH($E13,[1]BXIP!$K$1:$CD$1,0)+6,0)),VLOOKUP($C13,[1]BMIP!$E$2:$CD$304,MATCH($E13,[1]BMIP!$K$1:$CD$1,0)+6,0),\"\")","v":""},{"$f":"IF(ISNUMBER(VLOOKUP($C13,[1]PCPI!$E$2:$CE$304,MATCH($E13,[1]PCPI!$K$1:$CE$1,0)+6,0)),VLOOKUP($C13,[1]PCPI!$E$2:$CE$304,MATCH($E13,[1]PCPI!$K$1:$CE$1,0)+6,0),\"\")","v":7.1972213766605266},{"$f":"CB13/CB12-1","v":0.27257443927297409},{"$f":"IF(ISNUMBER(VLOOKUP($C13,[1]NGDP_R!$E$2:$CE$304,MATCH($E13,[1]NGDP_R!$K$1:$CE$1,0)+6,0)),VLOOKUP($C13,[1]NGDP_R!$E$2:$CE$304,MATCH($E13,[1]NGDP_R!$K$1:$CE$1,0)+6,0),\"\")","v":28578.627389112167}]
[null,-29,228,"Chile",1984,{"$f":"IF(ISNUMBER(VLOOKUP($C14,[1]NGDPD!$E$2:$CE$305,MATCH($E14,[1]NGDPD!$K$1:$CE$1,0)+6,0)),VLOOKUP($C14,[1]NGDPD!$E$2:$CE$305,MATCH($E14,[1]NGDPD!$K$1:$CE$1,0)+6,0),\"\")","v":20.10386511114741},{"$f":"IF(ISNUMBER(VLOOKUP($C14,[1]BX_WEO!$E$2:$CE$305,MATCH($E14,[1]BX_WEO!$K$1:$CE$1,0)+6,0)),VLOOKUP($C14,[1]BX_WEO!$E$2:$CE$305,MATCH($E14,[1]BX_WEO!$K$1:$CE$1,0)+6,0),\"\")","v":4.3140000000000001},{"$f":"IF(ISNUMBER(VLOOKUP($C14,[1]BM_WEO!$E$2:$CE$304,MATCH($E14,[1]BM_WEO!$K$1:$CE$1,0)+6,0)),VLOOKUP($C14,[1]BM_WEO!$E$2:$CE$304,MATCH($E14,[1]BM_WEO!$K$1:$CE$1,0)+6,0),\"\")","v":4.4950000000000001},140140.21912149992,1214477.7874228,1074337.5683013001,1,null,null,null,null,null,null,null,null,null,null,null,null,null,null,null,null,null,null,null,null,null,null,null,null,null,null,null,null,null,null,null,null,null,null,null,null,null,null,null,null,null,null,null,null,null,null,null,null,null,null,null,null,1984,-3.6808842275293475E-3,-9.00324385382178E-3,{"$f":"IF(ISNUMBER(VLOOKUP($C14,[1]BIS_WEO!$E$2:$CE$304,MATCH($E14,[1]BIS_WEO!$K$1:$CE$1,0)+6,0)),VLOOKUP($C14,[1]BIS_WEO!$E$2:$CE$304,MATCH($E14,[1]BIS_WEO!$K$1:$CE$1,0)+6,0),\"\")","v":0.107},5.3223596262924324E-3,35.067999999999998,1.7443411904189066,{"$f":"IF(ISNUMBER(VLOOKUP($C14,[1]IA_BP6!$E$2:$CE$304,MATCH($E14,[1]IA_BP6!$K$1:$CE$1,0)+6,0)),VLOOKUP($C14,[1]IA_BP6!$E$2:$CE$304,MATCH($E14,[1]IA_BP6!$K$1:$CE$1,0)+6,0),\"\")","v":""},null,{"$f":"IF(ISNUMBER(VLOOKUP($C14,[1]IL_BP6!$E$2:$CE$304,MATCH($E14,[1]IL_BP6!$K$1:$CE$1,0)+6,0)),VLOOKUP($C14,[1]IL_BP6!$E$2:$CE$304,MATCH($E14,[1]IL_BP6!$K$1:$CE$1,0)+6,0),\"\")","v":""},null,null,null,{"$f":"IF(ISNUMBER(VLOOKUP($C14,[1]BXIP!$E$2:$CD$304,MATCH($E14,[1]BXIP!$K$1:$CD$1,0)+6,0)),VLOOKUP($C14,[1]BXIP!$E$2:$CD$304,MATCH($E14,[1]BXIP!$K$1:$CD$1,0)+6,0),\"\")","v":""},{"$f":"IF(ISNUMBER(VLOOKUP($C14,[1]BMIP!$E$2:$CD$304,MATCH($E14,[1]BXIP!$K$1:$CD$1,0)+6,0)),VLOOKUP($C14,[1]BMIP!$E$2:$CD$304,MATCH($E14,[1]BMIP!$K$1:$CD$1,0)+6,0),\"\")","v":""},{"$f":"IF(ISNUMBER(VLOOKUP($C14,[1]PCPI!$E$2:$CE$304,MATCH($E14,[1]PCPI!$K$1:$CE$1,0)+6,0)),VLOOKUP($C14,[1]PCPI!$E$2:$CE$304,MATCH($E14,[1]PCPI!$K$1:$CE$1,0)+6,0),\"\")","v":8.6265990266939294},{"$f":"CB14/CB13-1","v":0.1986013178181032},{"$f":"IF(ISNUMBER(VLOOKUP($C14,[1]NGDP_R!$E$2:$CE$304,MATCH($E14,[1]NGDP_R!$K$1:$CE$1,0)+6,0)),VLOOKUP($C14,[1]NGDP_R!$E$2:$CE$304,MATCH($E14,[1]NGDP_R!$K$1:$CE$1,0)+6,0),\"\")","v":30260.634853285952}]
[null,-28,228,"Chile",1985,{"$f":"IF(ISNUMBER(VLOOKUP($C15,[1]NGDPD!$E$2:$CE$305,MATCH($E15,[1]NGDPD!$K$1:$CE$1,0)+6,0)),VLOOKUP($C15,[1]NGDPD!$E$2:$CE$305,MATCH($E15,[1]NGDPD!$K$1:$CE$1,0)+6,0),\"\")","v":17.238188909602428},{"$f":"IF(ISNUMBER(VLOOKUP($C15,[1]BX_WEO!$E$2:$CE$305,MATCH($E15,[1]BX_WEO!$K$1:$CE$1,0)+6,0)),VLOOKUP($C15,[1]BX_WEO!$E$2:$CE$305,MATCH($E15,[1]BX_WEO!$K$1:$CE$1,0)+6,0),\"\")","v":4.4966200000000001},{"$f":"IF(ISNUMBER(VLOOKUP($C15,[1]BM_WEO!$E$2:$CE$304,MATCH($E15,[1]BM_WEO!$K$1:$CE$1,0)+6,0)),VLOOKUP($C15,[1]BM_WEO!$E$2:$CE$304,MATCH($E15,[1]BM_WEO!$K$1:$CE$1,0)+6,0),\"\")","v":4.0008999999999997},104280.71064417996,1392052.4523818798,1287771.7417376998,1,null,null,null,null,null,null,null,null,null,null,null,null,null,null,null,null,null,null,null,null,null,null,null,null,null,null,null,null,null,null,null,null,null,null,null,null,null,null,null,null,null,null,null,null,null,null,null,null,null,null,null,null,1985,3.725565390702127E-2,2.8757081303585355E-2,{"$f":"IF(ISNUMBER(VLOOKUP($C15,[1]BIS_WEO!$E$2:$CE$304,MATCH($E15,[1]BIS_WEO!$K$1:$CE$1,0)+6,0)),VLOOKUP($C15,[1]BIS_WEO!$E$2:$CE$304,MATCH($E15,[1]BIS_WEO!$K$1:$CE$1,0)+6,0),\"\")","v":0.14649999999999999},8.4985726034359135E-3,25.721,1.4920941019315708,{"$f":"IF(ISNUMBER(VLOOKUP($C15,[1]IA_BP6!$E$2:$CE$304,MATCH($E15,[1]IA_BP6!$K$1:$CE$1,0)+6,0)),VLOOKUP($C15,[1]IA_BP6!$E$2:$CE$304,MATCH($E15,[1]IA_BP6!$K$1:$CE$1,0)+6,0),\"\")","v":""},null,{"$f":"IF(ISNUMBER(VLOOKUP($C15,[1]IL_BP6!$E$2:$CE$304,MATCH($E15,[1]IL_BP6!$K$1:$CE$1,0)+6,0)),VLOOKUP($C15,[1]IL_BP6!$E$2:$CE$304,MATCH($E15,[1]IL_BP6!$K$1:$CE$1,0)+6,0),\"\")","v":""},null,null,null,{"$f":"IF(ISNUMBER(VLOOKUP($C15,[1]BXIP!$E$2:$CD$304,MATCH($E15,[1]BXIP!$K$1:$CD$1,0)+6,0)),VLOOKUP($C15,[1]BXIP!$E$2:$CD$304,MATCH($E15,[1]BXIP!$K$1:$CD$1,0)+6,0),\"\")","v":""},{"$f":"IF(ISNUMBER(VLOOKUP($C15,[1]BMIP!$E$2:$CD$304,MATCH($E15,[1]BXIP!$K$1:$CD$1,0)+6,0)),VLOOKUP($C15,[1]BMIP!$E$2:$CD$304,MATCH($E15,[1]BMIP!$K$1:$CD$1,0)+6,0),\"\")","v":""},{"$f":"IF(ISNUMBER(VLOOKUP($C15,[1]PCPI!$E$2:$CE$304,MATCH($E15,[1]PCPI!$K$1:$CE$1,0)+6,0)),VLOOKUP($C15,[1]PCPI!$E$2:$CE$304,MATCH($E15,[1]PCPI!$K$1:$CE$1,0)+6,0),\"\")","v":11.275249232240832},0.30703295671341468,{"$f":"IF(ISNUMBER(VLOOKUP($C15,[1]NGDP_R!$E$2:$CE$304,MATCH($E15,[1]NGDP_R!$K$1:$CE$1,0)+6,0)),VLOOKUP($C15,[1]NGDP_R!$E$2:$CE$304,MATCH($E15,[1]NGDP_R!$K$1:$CE$1,0)+6,0),\"\")","v":30856.2489485765}]
{"$rows_left_out":44}
{"sheet":"Sheet4","index":1,"n_rows":1,"n_cols":8,"rows_kept":1,"cut":false,"hidden":true,"merged":[]}
[{"$f":"1","v":1},{"$f":"_xll.RiskCDS1([0]!NewMatrix2,[0]!NewMatrix2,Sheet4!A1+(0*1000000000))","v":{"$error":"#NAME?"}},{"$f":"_xll.RiskCDS2(Sheet4!B1,1,)","v":{"$error":"#NAME?"}},{"$f":"_xll.RiskCDS2(Sheet4!B1,2,)","v":{"$error":"#NAME?"}},{"$f":"_xll.RiskCDS2(Sheet4!B1,3,)","v":{"$error":"#NAME?"}},{"$f":"_xll.RiskCDS2(Sheet4!B1,4,)","v":{"$error":"#NAME?"}},{"$f":"_xll.RiskCDS2(Sheet4!B1,4,)","v":{"$error":"#NAME?"}},{"$f":"_xll.RiskCDS2(Sheet4!B1,5,)","v":{"$error":"#NAME?"}}]

{"sheet":"RiskSerializationData","index":2,"n_rows":15,"n_cols":48,"rows_kept":15,"cut":false,"hidden":true,"merged":[]}
[5,0]
[0]
[{"$f":"Simulations!$S$7","v":{"$error":"#NAME?"}},true,0,1,"GF1_rK0qDwEADgDlAAwjACYAOQBfAHMAdACCAJAAvwDhANsAKgD//wAAAAAAAQQAAAAABTAuMDAlAAAAASBuZmEgc3MsIHdpdGggdmFsIC8gTkZBIHZhbHVhdGlvbgEAAQEQAAIAAQpTdGF0aXN0aWNzAwEBAP8BAQEBAQABAQEABAAAAAEBAQEBAAEBAQAEAAAAAZQAAicAIG5mYSBzcywgd2l0aCB2YWwgLyBORkEgdmFsdWF0aW9uAAAvAQIAAgDHANEAAQECAZqZmZmZmak/AABmZmZmZmbuPwAABQABAQEAAQEBAA==",1,0,0,null,">75%","<25%",">90%",null,null,null,null,null,null,null,null,null,null,null,null,null,null,null,null,null,null,null,null,{"$f":"Simulations!$S$7","v":{"$error":"#NAME?"}},1,1,false,true,0,false,{"$f":"_","v":{"$error":"#NAME?"}}]
[{"$f":"Simulations!$BV$53","v":0},true,0,1,"GF1_rK0qDwEADgCuAAwjACYAOABDAFcAWABmAHQAiACqAKQAKgD//wAAAAAAAQQAAAAABDAuMCUAAAABBVNTIE5YAQABARAAAgABClN0YXRpc3RpY3MDAQEA/wEBAQEBAAEBAQAEAAAAAQEBAQEAAQEBAAQAAAABeAACDAAFU1MgTlgAAC8BAgACAJAAmgABAQIBmpmZmZmZqT8AAGZmZmZmZu4/AAAFAAEBAQABAQEA",1,0,0,null,">75%","<25%",">90%",null,null,null,null,null,null,null,null,null,null,null,null,null,null,null,null,null,null,null,null,{"$f":"Simulations!$BV$53","v":0},12,1,false,true,0,false,{"$f":"_","v":{"$error":"#NAME?"}}]
[{"$f":"Simulations!$BV$54","v":0},true,0,1,"GF1_rK0qDwEADgCpAAwjACYAOQBBAFUAVgBkAHIAgwClAJ8AKgD//wAAAAAAAQQAAAAABTAuMDAlAAAAAQJyMQEAAQEQAAIAAQpTdGF0aXN0aWNzAwEBAP8BAQEBAQABAQEABAAAAAEBAQEBAAEBAQAEAAAAAXYAAgkAAnIxAAAvAQIAAgCLAJUAAQECAZqZmZmZmak/AABmZmZmZmbuPwAABQABAQEAAQEBAA==",1,0,0,null,">75%","<25%",">90%",null,null,null,null,null,null,null,null,null,null,null,null,null,null,null,null,null,null,null,null,{"$f":"Simulations!$BV$54","v":0},13,1,false,true,0,false,{"$f":"_","v":{"$error":"#NAME?"}}]
[{"$f":"Simulations!$AV$31","v":{"$error":"#NAME?"}},false,1,1,"GF1_rK0qDwEADgD4AAwjACYAOABqAH4AfwCNAJsA0gD0AO4AKgD//wAAAAAAAQQAAAAABDAuMDAAAAABDW4uYS4gLyBhc3NldHMBH0NvbXBhcmlzb24gd2l0aCBOb3JtYWwoMCwwLjAzNSkBARAAAgABClN0YXRpc3RpY3MDAQEA/wEBAQEBAAEBAQAEAAAAAQEBAQEAAQEBAAQAAAACogACugAAFAANbi5hLiAvIGFzc2V0cwAALwECAAIAFgAPTm9ybWFsKDAsMC4wMzUpAQElAQIA2gDkAAEBAgGamZmZmZmpPwAAZmZmZmZm7j8AAAUAAQEBAAEBAQA=",2,0,0,null,null,null,null,null,null,null,null,null,null,null,null,null,null,null,null,null,null,null,null,null,null,null,null,{"$f":"Simulations!$AV$31","v":{"$error":"#NAME?"}},10,1,false,false,1,false,{"$f":"_","v":{"$error":"#NAME?"}},{"$f":"Simulations!$AV$31","v":{"$error":"#NAME?"}},10,1,true,false,1,true,{"$f":"_RiskNormal(0,0.035,_xll.RiskCorrmat(NewMatrix4,5))","v":{"$error":"#NAME?"}}]
[{"$f":"Simulations!$AR$35","v":{"$error":"#NAME?"}},false,1,1,"GF1_rK0qDwEADgD8AAwjACYAOABsAIAAgQCPAJ0A1gD4APIAKgD//wAAAAAAAQQAAAAABDAuMDAAAAABD24uYS4gLyBueCBzaG9jawEfQ29tcGFyaXNvbiB3aXRoIE5vcm1hbCgwLDAuMDAzKQEBEAACAAEKU3RhdGlzdGljcwMBAQD/AQEBAQEAAQEBAAQAAAABAQEBAQABAQEABAAAAAKkAAK+AAAWAA9uLmEuIC8gbnggc2hvY2sAAC8BAgACABYAD05vcm1hbCgwLDAuMDAzKQEBJQECAN4A6AABAQIBmpmZmZmZqT8AAGZmZmZmZu4/AAAFAAEBAQABAQEA",2,0,0,null,null,null,null,null,null,null,null,null,null,null,null,null,null,null,null,null,null,null,null,null,null,null,null,{"$f":"Simulations!$AR$35","v":{"$error":"#NAME?"}},26,1,false,false,1,false,{"$f":"_","v":{"$error":"#NAME?"}},{"$f":"Simulations!$AR$35","v":{"$error":"#NAME?"}},26,1,true,false,1,true,{"$f":"_RiskNormal(0,0.003,_xll.RiskCorrmat(NewMatrix4,1))","v":{"$error":"#NAME?"}}]
[0]
[false,13440,6215,7050,100]
[false,13440,6215,7050,500]
[false,13440,6215,7050,1000]
[false,13440,6215,7050,1500]
[false,13440,6215,7050,2000]
[0]
[0,false,false,10,0.95,1]
{"$rows_left_out":1}
{"sheet":"Simulations","index":3,"n_rows":61,"n_cols":71,"rows_kept":61,"cut":false,"hidden":false,"merged":[[3,15,3,17],[1,15,1,17],[2,15,2,17],[5,15,5,17],[52,65,52,67],[22,42,22,46],[15,48,17,52],[8,54,9,54],[8,53,9,53],[8,48,9,48],[8,49,9,49],[8,50,9,50],[8,51,9,51],[8,52,9,52],[42,48,42,51]],"read":"row_number_cap"}
[null,null,null,null,null,null,null,null,null,null,null,0.2,0.1,null,null,null,null,null,"NFA valuation",null,null,null,null,null,null,null,"Elasticity of NX to REER"]
[null,null,null,null,null,null,null,null,null,null,null,null,null,null,null,"∆%(REER)=",null,null,5.7568137279385284E-4,null,null,null,null,null,null,"Period 1",-0.3]
[null,null,null,null,null,null,null,null,null,null,null,null,null,null,null,"REER_0=",null,null,100,null,null,null,null,null,null,"Period 2",{"$f":"AA2","v":-0.3},null,null,null,null,null,null,null,null,null,null,null,null,null,null,null,null,null,null,null,null,null,"Fx composition of the stocks of A and L:"]
[null,null,null,null,null,null,null,null,null,null,null,null,null,null,null,"REER_1=",null,null,{"$f":"S3*(1+S2)","v":100.05756813727939},null,null,null,null,null,null,"Period 3",{"$f":"AA3","v":-0.3},null,null,null,null,null,null,null,null,null,null,null,null,null,null,null,null,null,null,null,null,null,null,"A/GDP","L/GDP"]
[null,null,null,null,null,null,null,null,null,null,null,null,null,null,null,null,null,null,null,null,null,null,null,null,null,"Period 4",{"$f":"AA4","v":-0.3},null,null,null,null,null,null,null,null,null,null,null,null,null,null,null,null,null,null,null,null,null,2016,{"$f":"Data!BU46","v":1.3384455079948305},{"$f":"Data!BW46","v":1.5355096797061651}]
[null,null,null,null,null,null,null,null,null,null,null,null,null,null,null,"nfa=",null,null,null,null,null,null,null,null,null,"Period 5",{"$f":"AA5","v":-0.3},null,null,null,null,null,null,null,null,null,null,null,null,null,null,null,null,null,null,null,null,null,"A, FC",1]
[null,null,null,null,null,null,null,null,null,null,null,null,null,null,null,null,"ER Solution:",null,{"$f":"_xll.RiskOutput()+S2","v":{"$error":"#NAME?"}},null,null,null,null,null,null,"Period 6",-0.3,null,null,null,null,null,null,null,null,null,null,null,null,null,null,null,null,null,null,null,null,null,"L, FC",0.3]
[null,null,null,null,null,null,null,null,null,null,null,null,null,null,null,null,null,null,null,null,null,null,null,null,null,null,{"$f":"SUM(AA2:AA7)","v":-1.8}]
[null,null,null,null,null,null,null,null,null,null,null,null,null,null,null,null,null,null,null,null,null,null,null,null,null,null,null,null,null,null,null,null,null,null,null,null,null,null,null,null,null,null,null,null,null,null,null,null,"NFA/GDP (Local Currency, Assets)","NFA/GDP (Foreign Currency, Assets)","NFA/GDP (Local Currency, Liab.)"]
[null,null,null,null,null,null,null,null,null,null,null,null,null,null,null,null,null,null,null,null,null,null,null,null,null,null,null,null,null,null,null,null,null,null,null,null,null,null,null,null,null,null,null,null,null,null,null,null,null,null,null,null,null,null,null,null,null,null,null,null,null,null,null,null,null,"adj. trade balance (using revalued S2 Ex Rate)",null,"assets/gdp","returns on assets","returns on liabilities","year"]
[null,null,null,null,null,null,null,null,null,null,null,null,null,null,null,null,null,null,null,null,null,null,null,null,null,null,null,null,null,null,null,null,null,null,null,null,null,null,null,null,null,null,null,null,null,"AR1","I if SC"]
[null,null,null,null,null,null,null,null,null,null,null,null,null,null,null,null,null,null,null,null,null,null,null,null,null,null,null,null,null,null,null,null,null,null,null,null,null,null,null,null,null,null,null,null,null,0.83,1,"nx"]
[null,null,null,null,null,null,null,null,null,null,null,null,null,null,null,null,null,null,null,null,null,null,null,null,null,null,null,null,null,null,null,null,null,null,null,null,null,null,null,null,null,null,null,null,null,0.23,1,"rg"]
[null,null,null,null,null,null,null,null,null,null,null,null,null,null,null,null,null,null,null,null,null,null,null,null,null,null,null,null,null,null,null,null,null,null,null,null,null,null,null,null,null,null,null,null,null,0.27,1,"ryol"]
[null,null,null,null,null,null,null,null,null,null,null,null,null,null,null,null,null,null,null,null,null,null,null,null,null,null,null,null,null,null,null,null,null,null,null,null,null,null,null,null,null,null,null,null,null,0.06,1,"ryoa"]
{"$rows_left_out":47}
{"sheet":"Nonlinear_1 (2)","index":4,"n_rows":128,"n_cols":12,"rows_kept":128,"cut":false,"hidden":true,"merged":[]}
[]
[]
[]
[]
["t",null,"A/M","residuals","Forecast",null,null,null,null,"A/M","residuals","forecast"]
[1,{"$f":"Data!#REF!","v":{"$error":"#REF!"}},{"$f":"IFERROR(#REF!,#N/A)","v":{"$error":"#N/A"}},{"$f":"IFERROR(C6-E6,#N/A)","v":{"$error":"#N/A"}},{"$f":"IFERROR(#REF!,#N/A)","v":{"$error":"#N/A"}},null,{"$f":"Data!D3","v":228},{"$f":"Data!D2","v":"Chile"},{"$f":"#REF!","v":{"$error":"#REF!"}},{"$f":"C6","v":{"$error":"#N/A"}},{"$f":"J6-L6","v":{"$error":"#N/A"}},{"$f":"IF(D6=\"#N/A\",#N/A,E6)","v":{"$error":"#N/A"}}]
[2,{"$f":"Data!#REF!","v":{"$error":"#REF!"}},{"$f":"IFERROR(#REF!,#N/A)","v":{"$error":"#N/A"}},{"$f":"IFERROR(C7-E7,#N/A)","v":{"$error":"#N/A"}},{"$f":"IFERROR(#REF!,#N/A)","v":{"$error":"#N/A"}},null,{"$f":"G6","v":228},{"$f":"H6","v":"Chile"},{"$f":"#REF!","v":{"$error":"#REF!"}},{"$f":"C7","v":{"$error":"#N/A"}},{"$f":"J7-L7","v":{"$error":"#N/A"}},{"$f":"IF(D7=\"#N/A\",#N/A,E7)","v":{"$error":"#N/A"}}]
[3,{"$f":"Data!E12","v":1982},{"$f":"IFERROR(#REF!,#N/A)","v":{"$error":"#N/A"}},{"$error":"#N/A"},{"$f":"IFERROR(#REF!,#N/A)","v":{"$error":"#N/A"}},null,{"$f":"G7","v":228},{"$f":"H7","v":"Chile"},{"$f":"#REF!","v":{"$error":"#REF!"}},{"$error":"#N/A"},{"$error":"#N/A"},{"$error":"#N/A"}]
[4,{"$f":"Data!E13","v":1983},{"$f":"IFERROR(#REF!,#N/A)","v":{"$error":"#N/A"}},{"$error":"#N/A"},{"$f":"IFERROR(#REF!,#N/A)","v":{"$error":"#N/A"}},null,228,"Chile",{"$f":"#REF!","v":{"$error":"#REF!"}},{"$error":"#N/A"},{"$error":"#N/A"},{"$error":"#N/A"}]
[5,{"$f":"Data!E14","v":1984},{"$f":"IFERROR(#REF!,#N/A)","v":{"$error":"#N/A"}},{"$error":"#N/A"},{"$f":"IFERROR(#REF!,#N/A)","v":{"$error":"#N/A"}},null,228,"Chile",{"$f":"#REF!","v":{"$error":"#REF!"}},{"$error":"#N/A"},{"$error":"#N/A"},{"$error":"#N/A"}]
[6,{"$f":"Data!E15","v":1985},{"$f":"IFERROR(#REF!,#N/A)","v":{"$error":"#N/A"}},{"$error":"#N/A"},{"$f":"IFERROR(#REF!,#N/A)","v":{"$error":"#N/A"}},null,228,"Chile",{"$f":"#REF!","v":{"$error":"#REF!"}},{"$error":"#N/A"},{"$error":"#N/A"},{"$error":"#N/A"}]
[7,{"$f":"Data!E16","v":1986},{"$f":"IFERROR(#REF!,#N/A)","v":{"$error":"#N/A"}},{"$error":"#N/A"},{"$f":"IFERROR(#REF!,#N/A)","v":{"$error":"#N/A"}},null,228,"Chile",{"$f":"#REF!","v":{"$error":"#REF!"}},{"$error":"#N/A"},{"$error":"#N/A"},{"$error":"#N/A"}]
[8,{"$f":"Data!E17","v":1987},{"$f":"IFERROR(#REF!,#N/A)","v":{"$error":"#N/A"}},{"$error":"#N/A"},{"$f":"IFERROR(#REF!,#N/A)","v":{"$error":"#N/A"}},null,228,"Chile",{"$f":"#REF!","v":{"$error":"#REF!"}},{"$error":"#N/A"},{"$error":"#N/A"},{"$error":"#N/A"}]
[9,{"$f":"Data!E18","v":1988},{"$f":"IFERROR(#REF!,#N/A)","v":{"$error":"#N/A"}},{"$error":"#N/A"},{"$f":"IFERROR(#REF!,#N/A)","v":{"$error":"#N/A"}},null,228,"Chile",{"$f":"#REF!","v":{"$error":"#REF!"}},{"$error":"#N/A"},{"$error":"#N/A"},{"$error":"#N/A"}]
[10,{"$f":"Data!E19","v":1989},{"$f":"IFERROR(#REF!,#N/A)","v":{"$error":"#N/A"}},{"$error":"#N/A"},{"$f":"IFERROR(#REF!,#N/A)","v":{"$error":"#N/A"}},null,228,"Chile",{"$f":"#REF!","v":{"$error":"#REF!"}},{"$error":"#N/A"},{"$error":"#N/A"},{"$error":"#N/A"}]
{"$rows_left_out":113}